Forum Discussion

harry's avatar
harry
Contributor
2 years ago

Not able to execute ReadyAPI version 3.7.0 using Maven

[INFO] --- ready-api-maven-plugin:3.7.0:test (1) @ Testing ---
Downloading from SmartBearPluginRepository: https://smartbearsoftware.com/repository/maven2/com/teamdev/jxbrowser/jxbrowser-win64/7.12/jxbrowser-win64-7.12.pom
Downloading from central: https://repo.maven.apache.org/maven2/com/teamdev/jxbrowser/jxbrowser-win64/7.12/jxbrowser-win64-7.12.pom
Downloading from SmartBear Repository: http://smartbearsoftware.com/repository/maven2/com/teamdev/jxbrowser/jxbrowser-win64/7.12/jxbrowser-win64-7.12.pom
Downloading from maven2-repository.java.net: http://java.net/projects/maven-repository/com/teamdev/jxbrowser/jxbrowser-win64/7.12/jxbrowser-win64-7.12.pom
Downloading from SmartBearPluginRepository: https://smartbearsoftware.com/repository/maven2/com/teamdev/jxbrowser/jxbrowser-mac/7.12/jxbrowser-mac-7.12.pom
Downloading from central: https://repo.maven.apache.org/maven2/com/teamdev/jxbrowser/jxbrowser-mac/7.12/jxbrowser-mac-7.12.pom
Downloading from SmartBear Repository: http://smartbearsoftware.com/repository/maven2/com/teamdev/jxbrowser/jxbrowser-mac/7.12/jxbrowser-mac-7.12.pom
Downloading from maven2-repository.java.net: http://java.net/projects/maven-repository/com/teamdev/jxbrowser/jxbrowser-mac/7.12/jxbrowser-mac-7.12.pom
Downloading from SmartBearPluginRepository: https://smartbearsoftware.com/repository/maven2/com/teamdev/jxbrowser/jxbrowser-linux64/7.12/jxbrowser-linux64-7.12.pom
Downloading from central: https://repo.maven.apache.org/maven2/com/teamdev/jxbrowser/jxbrowser-linux64/7.12/jxbrowser-linux64-7.12.pom
Downloading from SmartBear Repository: http://smartbearsoftware.com/repository/maven2/com/teamdev/jxbrowser/jxbrowser-linux64/7.12/jxbrowser-linux64-7.12.pom
Downloading from maven2-repository.java.net: http://java.net/projects/maven-repository/com/teamdev/jxbrowser/jxbrowser-linux64/7.12/jxbrowser-linux64-7.12.pom
Downloading from SmartBearPluginRepository: https://smartbearsoftware.com/repository/maven2/com/teamdev/jxbrowser/jxbrowser/7.12/jxbrowser-7.12.pom
Downloading from central: https://repo.maven.apache.org/maven2/com/teamdev/jxbrowser/jxbrowser/7.12/jxbrowser-7.12.pom
Downloading from SmartBear Repository: http://smartbearsoftware.com/repository/maven2/com/teamdev/jxbrowser/jxbrowser/7.12/jxbrowser-7.12.pom
Downloading from maven2-repository.java.net: http://java.net/projects/maven-repository/com/teamdev/jxbrowser/jxbrowser/7.12/jxbrowser-7.12.pom
Downloading from SmartBearPluginRepository: https://smartbearsoftware.com/repository/maven2/com/teamdev/jxbrowser/jxbrowser-swing/7.12/jxbrowser-swing-7.12.pom
Downloading from central: https://repo.maven.apache.org/maven2/com/teamdev/jxbrowser/jxbrowser-swing/7.12/jxbrowser-swing-7.12.pom
Downloading from SmartBear Repository: http://smartbearsoftware.com/repository/maven2/com/teamdev/jxbrowser/jxbrowser-swing/7.12/jxbrowser-swing-7.12.pom
Downloading from maven2-repository.java.net: http://java.net/projects/maven-repository/com/teamdev/jxbrowser/jxbrowser-swing/7.12/jxbrowser-swing-7.12.pom
Downloading from SmartBearPluginRepository: https://smartbearsoftware.com/repository/maven2/com/teamdev/jxbrowser/jxbrowser-win32/7.12/jxbrowser-win32-7.12.pom
Downloading from central: https://repo.maven.apache.org/maven2/com/teamdev/jxbrowser/jxbrowser-win32/7.12/jxbrowser-win32-7.12.pom
Downloading from SmartBear Repository: http://smartbearsoftware.com/repository/maven2/com/teamdev/jxbrowser/jxbrowser-win32/7.12/jxbrowser-win32-7.12.pom
Downloading from maven2-repository.java.net: http://java.net/projects/maven-repository/com/teamdev/jxbrowser/jxbrowser-win32/7.12/jxbrowser-win32-7.12.pom
[INFO] ------------------------------------------------------------------------
[INFO] BUILD FAILURE
[INFO] ------------------------------------------------------------------------
[INFO] Total time: 7.918 s
[INFO] Finished at: 2023-02-16T09:54:38-05:00
[INFO] ------------------------------------------------------------------------
[ERROR] Failed to execute goal com.smartbear:ready-api-maven-plugin:3.7.0:test (1) on project Testing: Execution 1 of goal com.smartbear:ready-api-maven-plugin:3.7.0:test failed: Plugin com.smartbear:ready-api-maven-plugin:3.7.0 or one of its dependencies could not be resolved: Failed to collect dependencies at com.smartbear:ready-api-maven-plugin:jar:3.7.0 -> com.smartbear:ready-api-soapui-pro:jar:3.7.0 -> com.smartbear:ready-api-soapui:jar:3.7.0 -> com.teamdev.jxbrowser:jxbrowser-win64:jar:7.12: Failed to read artifact descriptor for com.teamdev.jxbrowser:jxbrowser-win64:jar:7.12: Could not transfer artifact com.teamdev.jxbrowser:jxbrowser-win64:pom:7.12 from/to maven2-repository.java.net (http://java.net/projects/maven-repository/ğŸ˜ž Certificate for <java.net> doesn't match any of the subject alternative names: [*.java.net] -> [Help 1]
[ERROR]
[ERROR] To see the full stack trace of the errors, re-run Maven with the -e switch.
[ERROR] Re-run Maven using the -X switch to enable full debug logging.
[ERROR]
[ERROR] For more information about the errors and possible solutions, please read the following articles:
[ERROR] [Help 1] http://cwiki.apache.org/confluence/display/MAVEN/PluginResolutionException

 

As it was not able to find in the Ready API maven repo its getting redirected to 

: http://java.net/projects/maven-repository/com/teamdev/jxbrowser/jxbrowser-win32/7.12/jxbrowser-win32-7.12.pom

doesn't have it 

No RepliesBe the first to reply